最新消息:

CMake入门指南(转)

Linux Make 大步 1150浏览 0评论
Ps:KDE都用这个,所以这东西肯定得学会用
原文链接:http://www.cnblogs.com/sinojelly/archive/2010/05/22/1741337.html
CMake是一个比make更高级的编译配置工具,它可以根据不同平台、不同的编译器,生成相应的Makefile或者vcproj项目。
通 过编写CMakeLists.txt,可以控制生成的Makefile,从而控制编译过程。CMake自动生成的Makefile不仅可以通过make命 令构建项目生成目标文件,还支持安装(make install)、测试安装的程序是否能正确执行(make test,或者ctest)、生成当前平台的安装包(make package)、生成源码包(make package_source)、产生Dashboard显示数据并上传等高级功能,只要在CMakeLists.txt中简单配置,就可以完成很多复杂 的功能,包括写测试用例。
如果有嵌套目录,子目录下可以有自己的CMakeLists.txt。
总之,CMake是一个非常强大的编译自动配置工具,支持各种平台,KDE也是用它编译的,感兴趣的可以试用一下。
 
准备活动:
(1)安装cmake。
下载地址:http://www.cmake.org/cmake/resources/software.html
根据自己的需要下载相应的包即可,Windows下可以下载zip压缩的绿色版本,还可以下载源代码。
CMake入门指南(转) - ksharp_dabu - ksharp_dabu的博客

 

 

(2)运行cmake的方法。(GUI、命令行)
http://www.cmake.org/cmake/help/runningcmake.html

CMake使用步骤:

运行GUI的cmake界面:
cmake-2.8.1-win32-x86bincmake-gui.exe
CMake入门指南(转) - ksharp_dabu - ksharp_dabu的博客

 
执行Configure:
运行之后,生成了如下文件:

CMake入门指南(转) - ksharp_dabu - ksharp_dabu的博客

 
生成Makefile:
执行Generate之后生成如下文件:

CMake入门指南(转) - ksharp_dabu - ksharp_dabu的博客

 

运行make进行编译:

CMake入门指南(转) - ksharp_dabu - ksharp_dabu的博客

 

编译完成后,在build目录生成Tutorial.exe,运行Tutorial.exe 25就可以看到运行结果:

CMake入门指南(转) - ksharp_dabu - ksharp_dabu的博客

 

运行make install安装程序:

CMake入门指南(转) - ksharp_dabu - ksharp_dabu的博客

 

运行make test进行测试:
CMake入门指南(转) - ksharp_dabu - ksharp_dabu的博客

 

 
通过cmake tutorial学习CMake配置方法
http://www.cmake.org/cmake/help/cmake_tutorial.html
可以在源代码的Tests/Turorial目录中找到这个手册对应的代码。
CMake入门指南(转) - ksharp_dabu - ksharp_dabu的博客

 

1、Step1。
(如 果不知道如何使用cmake,以及如何使用编译产生的Turorial.exe,可先看下前面“CMake使用步骤”的说明,它以Step4为例详细介绍 了使用过程,Step1的配置可能不够完全,比如无法运行make install,无法运行make test,但可以参考。)
简单的程序编译。
(1)运行GUI的cmake,指定要编译的源代码路径和二进制文件路径(会自动创建)。
CMake入门指南(转) - ksharp_dabu - ksharp_dabu的博客

 

(2)点击Configure,配置成功后,再点击Generate。
配置需要选择合适的编译器,虽然我安装了VC2008,但没有配置成功;选择Unix Makefiles,配置成功,它自动找到了DevC++下的gcc.exe等编译器。

CMake入门指南(转) - ksharp_dabu - ksharp_dabu的博客

 

(3)在build3目录执行make,就能够编译生成Turorial.exe了。
D:ProjectsLabtestngppcmake-2.8.1TestsTutorialStep1build3>make
Linking CXX executable Tutorial.exe
[100%] Built target Tutorial
可以运行一下Turorial.exe:

D:ProjectsLabtestngppcmake-2.8.1TestsTutorialStep1build3>Tutorial.exe
Tutorial.exe Version 1.0
Usage: Tutorial.exe number
D:ProjectsLabtestngppcmake-2.8.1TestsTutorialStep1build3>Tutorial.exe 4
The square root of 4 is 2
2、Step2
把子目录编译为库,并且链接到最终的可执行文件。

include_directories ("${PROJECT_SOURCE_DIR}/MathFunctions")
add_subdirectory (
MathFunctions)   # 使得子目录MathFunctions也能被编译

 

# add the executable
add_executable (Tutorial tutorial.cxx)
target_link_libraries (Tutorial MathFunctions)
产生makefile:

在GUI上点击Configure,之后Generate还是灰色,再次点击Configure,Generate就可以点击了。
编译:
在build目录运行make,即可开始编译,但是开始会报告sh.exe运行异常,应该是Tools下的UnxUtils的sh.exe与Win7不兼容,发现有如下make文件,估计是它导致的,于是把它重命名,不使用UnxUtils下的make,就OK乐。
D:ToolsCMDUnxUtilsusrlocalwbinmake.exe
编译过程:
D:ProjectsLabtestngppcmake-2.8.1TestsTutorialStep2build>make
[ 50%] Building CXX object MathFunctions/CMakeFiles/MathFunctions.dir/mysqrt.cxx
.obj
Linking CXX static library libMathFunctions.a
[ 50%] Built target MathFunctions
Linking CXX executable Tutorial.exe
[100%] Built target Tutorial

3、Step3

支持make install把程序安装到系统指定目录,并且运行一些测试检查它是否能够正常工作。
a、安装时使用的基础目录,由CMAKE_INSTALL_PREFIX指定。
b、可以通过一个很简单的用例检查程序是否运行起来,没有出现异常。(TurotialRuns只是一个用例名字)
add_test (TutorialRuns Tutorial 25)
c、macro方式进行多组数据的测试是非常简洁方便的。
#define a macro to simplify adding tests, then use it
macro (do_test arg result)
  add_test (TutorialComp${arg} Tutorial ${arg})
  set_tests_properties (TutorialComp${arg}
    PROPERTIES PASS_REGULAR_EXPRESSION ${result})
endmacro (do_test)
 
# do a bunch of result based tests
do_test (25 "25 is 5")
do_test (-25 "-25 is 0")
执行make install:
D:ProjectsLabtestngppcmake-2.8.1TestsTutorialStep3build>make install
[ 50%] "Built target MathFunctions"
[100%] "Built target Tutorial"
Install the project...
-- Install configuration: ""
-- Installing: C:/Program Files/Tutorial/bin/Tutorial.exe
-- Installing: C:/Program Files/Tutorial/include/TutorialConfig.h
-- Installing: C:/Program Files/Tutorial/bin/libMathFunctions.a
-- Installing: C:/Program Files/Tutorial/include/MathFunctions.h
安装结果:
C:Program FilesTutorial>tree /f
C:.
├─bin
│ libMathFunctions.a
│ Tutorial.exe

└─include
        MathFunctions.h
        TutorialConfig.h
执行make test:
D:ProjectsLabtestngppcmake-2.8.1TestsTutorialStep3build>make test
Running tests...
Test project D:/Projects/Lab/testngpp/cmake-2.8.1/Tests/Tutorial/Step3/build
    Start 1: TutorialRuns
1/5 Test #1: TutorialRuns ..................... Passed 0.01 sec
    Start 2: TutorialComp25
2/5 Test #2: TutorialComp25 ................... Passed 0.01 sec
    Start 3: TutorialNegative
3/5 Test #3: TutorialNegative ................. Passed 0.01 sec
    Start 4: TutorialSmall
4/5 Test #4: TutorialSmall .................... Passed 0.00 sec
    Start 5: TutorialUsage
5/5 Test #5: TutorialUsage .................... Passed 0.00 sec
 
100% tests passed, 0 tests failed out of 5
 
Total Test time (real) = 0.13 sec
修改一个测试用例,让它不过:
修改顶层CMakeLists.txt,然后重新Configure和Generate,然后make test即可看到结果。
D:ProjectsLabtestngppcmake-2.8.1TestsTutorialStep3build>make test
Running tests...
Test project D:/Projects/Lab/testngpp/cmake-2.8.1/Tests/Tutorial/Step3/build
    Start 1: TutorialRuns
1/5 Test #1: TutorialRuns ..................... Passed 0.01 sec
    Start 2: TutorialComp25
2/5 Test #2: TutorialComp25 ...................***Failed Required regular expre
ssion not found.Regex=[25 is 3
] 0.01 sec
    Start 3: TutorialNegative
3/5 Test #3: TutorialNegative ................. Passed 0.01 sec
    Start 4: TutorialSmall
4/5 Test #4: TutorialSmall .................... Passed 0.01 sec
    Start 5: TutorialUsage
5/5 Test #5: TutorialUsage .................... Passed 0.01 sec
 
80% tests passed, 1 tests failed out of 5
 
Total Test time (real) = 0.13 sec
 
The following tests FAILED:
          2 - TutorialComp25 (Failed)
Errors while running CTest
make: *** [test] Error 8

4、Step4

检查系统是否支持log和exp函数。(log和exp都是数学运算函数)
检查方法:
(1)顶层配置中使用CheckFunctionExists.cmake
# does this system provide the log and exp functions?
include (CheckFunctionExists.cmake)
check_function_exists (log HAVE_LOG)
check_function_exists (exp HAVE_EXP)
(2)修改.in文件,定义宏。(修改TutorialConfig.h.in,cmake执行中会把宏定义为合适的值,生成TurorialConfig.h,供编译时使用)
// does the platform provide exp and log functions?
#cmakedefine HAVE_LOG
#cmakedefine HAVE_EXP
(3)在代码中使用宏和log函数等。
// if we have both log and exp then use them
#if defined (HAVE_LOG) && defined (HAVE_EXP)
  result = exp(log(x)*0.5);
#else // otherwise use an iterative approach
Step4的完整配置、生成Makefile、编译、运行、安装、测试过程,参见最前面的“CMake使用步骤”。
5、Step5
动态生成源文件,自动把源文件编译进系统中。
make的时候出错了:
D:ProjectsLabtestngppcmake-2.8.1TestsTutorialStep5build>make
Scanning dependencies of target MakeTable
[ 25%] Building CXX object MathFunctions/CMakeFiles/MakeTable.dir/MakeTable.cxx.
obj
Linking CXX executable MakeTable.exe
[ 25%] "Built target MakeTable"
[ 50%] Generating Table.h
'.' 不是内部或外部命令,也不是可运行的程序
或批处理文件。
make[2]: *** [MathFunctions/Table.h] Error 1
make[1]: *** [MathFunctions/CMakeFiles/MathFunctions.dir/all] Error 2
make: *** [all] Error 2
问题分析:
首先看build/makefile文件,关于MakeTable有如下规则:
# Build rule for target.
MakeTable: cmake_check_build_system
    $(MAKE) -f CMakeFiles/Makefile2 MakeTable
.PHONY : MakeTable
再看Makefile2文件,找到出错时正在编译的目标。
# All Build rule for target.
MathFunctions/CMakeFiles/MakeTable.dir/all:
    $(MAKE) -f MathFunctions/CMakeFiles/MakeTable.dir/build.make MathFunctions/CMakeFiles/MakeTable.dir/depend
    $(MAKE) -f MathFunctions/CMakeFiles/MakeTable.dir/build.make MathFunctions/CMakeFiles/MakeTable.dir/build
    $(CMAKE_COMMAND) -E cmake_progress_report D:/Projects/Lab/testngpp/cmake-2.8.1/Tests/Tutorial/Step5/build/CMakeFiles 1
    @echo "Built target MakeTable"
.PHONY : MathFunctions/CMakeFiles/MakeTable.dir/all
Make规则的执行顺序是按

转载请注明:大步's Blog » CMake入门指南(转)

与本文相关的文章

  • 暂无相关文章!
发表我的评论
取消评论

表情

Hi,您需要填写昵称和邮箱!

  • 昵称 (必填)
  • 邮箱 (必填)
  • 网址
SiteMap